Hinweis: Das Forum wird geschlossen! Neue Registrierungen sind nicht mehr möglich!

 Zurück zu Pro-Linux   Foren-Übersicht   FAQ     Suchen    Mitgliederliste
Probleme mit dem Kompilieren von gob

 
Neuen Beitrag schreiben   Auf Beitrag antworten    Pro-Linux Foren-Übersicht -> Software
Vorheriges Thema anzeigen :: Nächstes Thema anzeigen  
Autor Nachricht
christian



Anmeldungsdatum: 13.07.2001
Beiträge: 238

BeitragVerfasst am: 02. Sep 2002 17:07   Titel: Probleme mit dem Kompilieren von gob

Hallo zusammen.

Ich versuche gerade GNOME-Pilot zu installieren.
Dazu brauche ich das Packet "gob". Ich versuche gerade dieses Packet zu kompilieren
und erhalte Fehlermeldungen die ich nicht ganz verstehen.

Der Befehlt "./configure" läuft ohne Fehler durch.
Sobald ich "make" eingeben erhalte ich folgende Meldung:
========================================================

make all-recursive
make: Wechsel in das Verzeichnis Verzeichnis »/tmp/gob-1.0.12«
Making all in src
make: Wechsel in das Verzeichnis Verzeichnis »/tmp/gob-1.0.12/src«
make: Wechsel in das Verzeichnis Verzeichnis »/tmp/gob-1.0.12/src«
gcc -g -O2 -Wall -Wpointer-arith -Wmissing-prototypes -Wmissing-declarations -DPKGDATADIR=\"/usr/local/share/gob\" -o gob main.o treefuncs.o out.o util.o checks.o parse.o lexer.o -lm -L/usr/lib -lglib
lexer.o: In function `yylex':
/tmp/gob-1.0.12/src/lex.yy.c:1969: undefined reference to `yywrap'
lexer.o: In function `input':
/tmp/gob-1.0.12/src/lex.yy.c:2313: undefined reference to `yywrap'
collect2: ld returned 1 exit status
make: *** [gob] Fehler 1
make: Verlassen des Verzeichnisses Verzeichnis »/tmp/gob-1.0.12/src«
make: *** [all-recursive] Fehler 1
make: Verlassen des Verzeichnisses Verzeichnis »/tmp/gob-1.0.12/src«
make: *** [all-recursive] Fehler 1
make: Verlassen des Verzeichnisses Verzeichnis »/tmp/gob-1.0.12«
make: *** [all-recursive-am] Fehler 2

Was bedeutet "Fehler 1"?

Danke für die Tips.

Gruß,
Christian
_________________
[-= Don't drink and root =-]
 
Benutzer-Profile anzeigen Private Nachricht senden E-Mail senden Website dieses Benutzers besuchen

Bob Gomorrha
Gast





BeitragVerfasst am: 04. Sep 2002 7:40   Titel: Re: Probleme mit dem Kompilieren von gob

Fehler 1 bedeutet Fehler 1 - in Deinen Fall steht der Klartext etwas weiter oben: undeclared reference to yywrap.
Irgendwas bezieht sich in der Datei tmp/gob-1.0.12/src/lex.yy.c auf yywrap und da gibt´s Probleme.

Geh mal auf http://www.rpmfind.net und lad Dir das ganze als Paket runter, vielleicht hilft das.

cu

bg
 

Beiträge vom vorherigen Thema anzeigen:   
     Pro-Linux Foren-Übersicht -> Software Alle Zeiten sind GMT + 1 Stunde
Seite 1 von 1

 
Gehen Sie zu:  

Powered by phpBB © phpBB Group
pro_linux Theme © 2004 by Mandaxy