Hinweis: Das Forum wird geschlossen! Neue Registrierungen sind nicht mehr möglich!

 Zurück zu Pro-Linux   Foren-Übersicht   FAQ     Suchen    Mitgliederliste
Probleme mit Kdevelop&co....

 
Neuen Beitrag schreiben   Auf Beitrag antworten    Pro-Linux Foren-Übersicht -> Programmieren - Allgemein
Vorheriges Thema anzeigen :: Nächstes Thema anzeigen  
Autor Nachricht
DERHANS



Anmeldungsdatum: 05.05.2004
Beiträge: 38

BeitragVerfasst am: 25. Sep 2004 14:07   Titel: Probleme mit Kdevelop&co....

Moin
Hab nach langer zeit mal wieder gelegenheit n bischen zu programmieren, hab jetzt allerdings n paar probleme beim arbeiten mit kdevelop. Konnte die meisten selber abstellen bis auf eins...

nach dem ausführen von automake und autoconf sowie des configure scripts erhalte ich von make folgende fehlerausgabe:

*cd "/home/hans/projekte/klame/debug" && WANT_AUTOCONF_2_5="1" WANT_AUTOMAKE_1_6="1" gmake -k
*cd /home/hans/projekte/klame && /bin/sh /home/hans/projekte/klame/admin/missing --run automake-1.6 --gnu Makefile
*cd /home/hans/projekte/klame && perl admin/am_edit Makefile.in
*cd /home/hans/projekte/klame && rm -f configure && gmake -f admin/Makefile.common configure
*Can't locate object method "path" via package "Request" at /usr/share/autoconf/Autom4te/C4che.pm line 69, <GEN1> line 111.
*gmake[1]: *** [configure] Fehler 1
*gmake: *** [/home/hans/projekte/klame/configure] Fehler 2
*gmake: Konnte die »make«-Steuerdatei »Makefile« nicht neu erstellen.
*cd /home/hans/projekte/klame && /bin/sh /home/hans/projekte/klame/admin/missing --run autoheader
*Can't locate object method "path" via package "Request" at /usr/share/autoconf/Autom4te/C4che.pm line 69, <GEN1> line 111.
*autoheader-2.5x: /usr/bin/autom4te failed with exit status: 1
*gmake: *** [/home/hans/projekte/klame/config.h.in] Fehler 1
*gmake: Das Target »all« wurde wegen Fehlern nicht aktualisiert.
**** Exited with status: 2 ***

verwende Mandrake 10.0 mit Kdevelop 3.0 wäre schön wenn mir jemand helfen könnte...

Greetz DERHANS
 
Benutzer-Profile anzeigen Private Nachricht senden

_MP_



Anmeldungsdatum: 04.09.2004
Beiträge: 45

BeitragVerfasst am: 29. Sep 2004 6:12   Titel:

DERHANS hat folgendes geschrieben::

*Can't locate object method "path" via package "Request" at /usr/share/autoconf/Autom4te/C4che.pm line 69, <GEN1> line 111.


Da dürfte das Problem liegen. Nach dem du jetzt aber nicht verraten hast, ob das vielleicht ein C++-Projekt ist, ist es recht schwer, hier über die genaue Ursache zu orakeln.

Wie hast du das Projekt denn erstellt - mit dem KDevelop-Wizard?
_________________
cu

MP

http://www.linuxboard.org - das Linux Entwickler- und Anwenderforum
 
Benutzer-Profile anzeigen Private Nachricht senden

DERHANS



Anmeldungsdatum: 05.05.2004
Beiträge: 38

BeitragVerfasst am: 01. Okt 2004 11:38   Titel:

Hab das projekt mit Kdevelop erstellt C++ -> KDE -> Simple KDE Application...
 
Benutzer-Profile anzeigen Private Nachricht senden

Beiträge vom vorherigen Thema anzeigen:   
     Pro-Linux Foren-Übersicht -> Programmieren - Allgemein Alle Zeiten sind GMT + 1 Stunde
Seite 1 von 1

 
Gehen Sie zu:  

Powered by phpBB © phpBB Group
pro_linux Theme © 2004 by Mandaxy