Hinweis: Das Forum wird geschlossen! Neue Registrierungen sind nicht mehr möglich!

 Zurück zu Pro-Linux   Foren-Übersicht   FAQ     Suchen    Mitgliederliste
kPoGre: welche Library fehlt mir?

 
Neuen Beitrag schreiben   Auf Beitrag antworten    Pro-Linux Foren-Übersicht -> Programmieren - Allgemein
Vorheriges Thema anzeigen :: Nächstes Thema anzeigen  
Autor Nachricht
brum
Gast





BeitragVerfasst am: 06. Jan 2005 15:16   Titel: kPoGre: welche Library fehlt mir?

Hallo ,

im Einsatz MDK 10.1, möchte PoGre (Postgresql Frontend) installieren.
SuSE-rpm's und Source gibt's bei www.kde-apps.org.

Nach Installation der SuSE-Pakete Fehlermeldung:
--------------------------------------------------------------------------------------------------------
SuSE9.1 kpogre1.3.0

[joern@localhost joern]$ /opt/kde3/bin/kpogre &
[1] 3539
[joern@localhost joern]$ kpogre: symbol lookup error: kpogre: undefined symbol: _ZN11KMainWindow7setIconERK7QPixmap

[1]+ Exit 127
-----------------------------------------------------------------------------------------------------

Viele Grüße
brum

PS: Der Versuch, es zu kompilliere endete bei make mit Fehlermeldung:

-------------------------------------------------------------------------------------------------------
/usr/include/pqxx/transaction_base.hxx: At global scope:
/usr/include/pqxx/transaction_base.hxx:290: error: using-declaration for non-member at class scope
/usr/include/pqxx/transaction_base.hxx:290: error: expected `;' before '*' token
/usr/include/pqxx/transaction_base.hxx:291: error: expected `;' before "void"
In file included from ../DbObjects/kpgserver.h:21,
from kpgserverproppage.cpp:30:
../DbObjects/kpgtreeitem.h:41: error: expected `)' before "_oid"
../DbObjects/kpgtreeitem.h:63: error: ISO C++ forbids declaration of `oid' with no type
../DbObjects/kpgtreeitem.h:63: error: invalid use of `::'
../DbObjects/kpgtreeitem.h:63: error: expected `;' before "oid"
../DbObjects/kpgtreeitem.h:66: error: expected `;' before "const"
../DbObjects/kpgtreeitem.h:73: error: using-declaration for non-member at class scope
../DbObjects/kpgtreeitem.h:73: error: expected `;' before "m_oid"
../DbObjects/kpgtreeitem.h: In copy constructor `KPGOidName::KPGOidName(const KPGOidName&)':
../DbObjects/kpgtreeitem.h:49: error: `m_oid' undeclared (first use this function)
../DbObjects/kpgtreeitem.h:49: error: 'const class KPGOidName' has no member named 'oid'
../DbObjects/kpgtreeitem.h: In member function `void KPGOidName::operator=(const KPGOidName&)':
../DbObjects/kpgtreeitem.h:58: error: `m_oid' undeclared (first use this function)
../DbObjects/kpgtreeitem.h:58: error: 'const class KPGOidName' has no member named 'oid'
../DbObjects/kpgtreeitem.h: At global scope:
../DbObjects/kpgtreeitem.h:106: error: `pqxx::oid' has not been declared
../DbObjects/kpgtreeitem.h:106: error: ISO C++ forbids declaration of `parameter' with no type
kpgserverproppage.cpp: In member function `virtual void KPGServerPropPage::slotTablePropDblClicked(int, int, int, const QPoint&)':
kpgserverproppage.cpp:59: error: `oid' is not a member of `pqxx'
kpgserverproppage.cpp:59: error: expected `;' before "_oid"
kpgserverproppage.cpp:61: error: `_oid' undeclared (first use this function)
kpgserverproppage.cpp:58: warning: unused variable 'pLabel'
In file included from kpgserverproppage.cpp:71:
kpgserverproppage.moc: At global scope:
kpgserverproppage.moc:98: error: expected unqualified-id before "t0"
kpgserverproppage.moc:98: error: expected `,' or `...' before "t0"
kpgserverproppage.moc:99: error: ISO C++ forbids declaration of `parameter' with no type
kpgserverproppage.moc: In member function `void KPGServerPropPage::sigSearchObject(int)':
kpgserverproppage.moc:106: error: `t0' undeclared (first use this function)
kpgserverproppage.moc: In member function `virtual bool KPGServerPropPage::qt_emit(int, QUObject*)':
kpgserverproppage.moc:124: error: ISO C++ forbids declaration of `type name' with no type
kpgserverproppage.moc:124: error: ISO C++ forbids declaration of `type name' with no type
kpgserverproppage.moc:124: error: expected primary-expression before "const"
kpgserverproppage.moc:124: error: expected `)' before "const"
make[3]: *** [kpgserverproppage.lo] Fehler 1
make[3]: Leaving directory `/home/joern/PSQL_AddOns/kPoGre/source/kpogre-1.3.0/kpogre/PropertyPages'
make[2]: *** [all-recursive] Fehler 1
------------------------------------------------------------------------------------------------------
 

brum
Gast





BeitragVerfasst am: 06. Jan 2005 16:43   Titel: möglich:

Wahrscheinlich libXcourser.so.1, die es mit xorg.86 nicht mehr gibt ?
 

Beiträge vom vorherigen Thema anzeigen:   
     Pro-Linux Foren-Übersicht -> Programmieren - Allgemein Alle Zeiten sind GMT + 1 Stunde
Seite 1 von 1

 
Gehen Sie zu:  

Powered by phpBB © phpBB Group
pro_linux Theme © 2004 by Mandaxy