Rekompilierung von RPM

Software besorgen und anwenden
Antworten
Nachricht
Autor
exc64user

Rekompilierung von RPM

#1 Beitrag von exc64user » 31. Aug 2008 9:07

hallo

nun habe ich das src-rpm von cinepaint in der version 0.22-20.3 versucht mit dem befehl
rpmbuild --rebuild neu zu compilieren aber der vorgang bricht an der gleichen stelle ab wie die tarball-version bei make

br_Image.cpp:150: error: 'strlen' was not declared in this scope
br_Image.cpp:151: error: 'strcpy' was not declared in this scope
br_Image.cpp: In member function 'void br::Image::name(const char*)':
br_Image.cpp:191: error: 'strlen' was not declared in this scope
br_Image.cpp:192: error: 'strcpy' was not declared in this scope
br_Image.cpp: In member function 'void br::BrImgVector::report_offsets() const':
br_Image.cpp:732: warning: deprecated conversion from string constant to 'char*'
br_Image.cpp:732: warning: deprecated conversion from string constant to 'char*'
make[3]: *** [br_Image.lo] Fehler 1
make[3]: Leaving directory `/usr/src/packages/BUILD/cinepaint-0.22-0/plug-ins/bracketing_to_hdr/br_core'
make[2]: *** [all-recursive] Fehler 1
make[2]: Leaving directory `/usr/src/packages/BUILD/cinepaint-0.22-0/plug-ins/bracketing_to_hdr'
make[1]: *** [all-recursive] Fehler 1
make[1]: Leaving directory `/usr/src/packages/BUILD/cinepaint-0.22-0/plug-ins'
make: *** [all-recursive] Fehler 1
error: Bad exit status from /var/tmp/rpm-tmp.63137 (%build)


RPM build errors:
Bad exit status from /var/tmp/rpm-tmp.63137 (%build)

hat hier jemand eine idee wie das sein kann und was diese meldung eigendlich bedeutet?

Das tarball lies sich nicht copilieren das aber die src-rpm version an der stelle ebenfals hier ins stocken kommt finde ich schon ein wenig seltsam.

Benutzeravatar
Janka
Beiträge: 3581
Registriert: 11. Feb 2006 19:10

#2 Beitrag von Janka » 01. Sep 2008 9:29

Hier hab ich noch was dazu gefunden.
viewtopic.php?t=1032840&highlight=cinepaint
Janka
Ich vertonne Spam immer in /dev/dsp statt /dev/null.
Ich mag die Schreie.

Antworten